تمیزکاری آبی
scope note: تمیزکاری سطح فلز و آماده‌سازی آن برای عملیات بعدی با استفاده از محلول‌های آبی حاوی ترکیبات عامل سطح‌فعال و نمک‌های قلیایی و عامل منزوی‌ساز
broader: تمیزکاری سطح
preferred label: aqueous cleaning @en
type: Concept

تمیزکاری سطح
preferred label: surface cleaning @en
type: Concept
narrower: تمیزکاری آبی