خوردگی باکتریایی
scope note: خوردگی حاصل از موادی مثل سولفوریک‌اسید یا آمونیاک که براثر فعالیت باکتری‌های خاصی تولید می‌شود.
broader: خوردگی
preferred label: bacterial corrosion @en
type: Concept

خوردگی
preferred label: corrosion @en
type: Concept
narrower: خوردگی باکتریایی