خوردگی رشته‌ای
scope note: نوعی خوردگی به‌صورت رشته‌های کوچک و پراکنده که در زیر فیلم‌ها (film) و پوشش‌های غیرمقاوم به وجود می‌آید
narrower: خوردگی زیرپوششی
broader: خوردگی
preferred label: filiform corrosion @en
type: Concept

خوردگی زیرپوششی
preferred label: underfilm corrosion @en
type: Concept
broader: خوردگی رشته‌ای

خوردگی
preferred label: corrosion @en
type: Concept
narrower: خوردگی رشته‌ای