خوردگی سولفیدی
scope note: نوعی خوردگی ناشی از ترکیب انواع سولفیدها با فلز در دمای بالا که موجب ایجاد محصولات سولفیدی میشود.
broader: خوردگی
preferred label: sulfidic corrosion @en
type: Concept

خوردگی
preferred label: corrosion @en
type: Concept
narrower: خوردگی سولفیدی