خوردگی تورمی
scope note: نوعی خوردگی در مصالح ساختمانی غیرفلزی و آلی که در نتیجۀ واکنش‌های شیمیایی در محلول‌های آبی و تولید ترکیبات حجیم جدید در داخل ماده به وجود می‌آید.
narrower: خوردگی محلولی
broader: خوردگی
preferred label: swelling corrosion @en
type: Concept

خوردگی محلولی
preferred label: solution corrosion @en
type: Concept
broader: خوردگی تورمی

خوردگی
preferred label: corrosion @en
type: Concept
narrower: خوردگی تورمی