بسپارش
preferred label: polymerization @en
type: Concept
narrower: بسپارش توده‌ای

بسپارش توده‌ای
scope note: بسپارشی که در آن فقط تکپار و آغازگر بسپارش شرکت دارند.
broader: بسپارش
preferred label: bulk polymerization @en
type: Concept