بسپارش کربوکاتیونی
scope note: نوعی بسپارش کاتیونی که ازطریق کربوکاتیون به‌عنوان مرکز فعال پیش می‌رود.
broader: بسپارش کاتیونی
preferred label: carbocationic polymerization @en
type: Concept

بسپارش کاتیونی
preferred label: cationic polymerization @en
type: Concept
narrower: بسپارش کربوکاتیونی