بسپارش ریشالی
scope note: بسپارش در محلولی از یک عاسف که شامل گروه ‌بسپارش‌پذیر در بالای غلظت بحرانی ریشال است.
broader: بسپارش
preferred label: micellar polymerization @en
type: Concept

بسپارش
preferred label: polymerization @en
type: Concept
narrower: بسپارش ریشالی