بسپارش
preferred label: polymerization @en
type: Concept
narrower: بسپارش الگویی

بسپارش الگویی
scope note: بسپارش تکپارهایی که به‌صورت منظم به یک الگو متصل هستند تا بسپاری با ساختاری کاملاً مشخص ایجاد کنند.
broader: بسپارش
preferred label: template polymerization @en
type: Concept