بسپارش
preferred label: polymerization @en
type: Concept
narrower: بسپارش گرمایی

بسپارش گرمایی
scope note: بسپارشی که بدون استفاده از آغازگر و فقط با گرما آغاز می‌شود.
broader: بسپارش
preferred label: thermal polymerization @en
type: Concept