سرشکنی نقشه
scope note: هر تغییر در موقعیت افقی عوارض نقشه برای منطبق‌ کردن آن با نقاط واپایش معین یا انتقال آن به شبکه‌ای با مقیاس مشخص
broader: نقشه‌نگاری
preferred label: map adjustment @en
type: Concept

نقشه‌نگاری
preferred label: cartography @en
type: Concept
narrower: سرشکنی نقشه