نقشه‌نگاری
preferred label: cartography @en
type: Concept
narrower: شبکه‌بندی نقشه

شبکه‌بندی نقشه
scope note: شبکه‌ای که برای فراهم کردن یک دستگاه مختصات مناسب بر روی نقشه افکنده میشود.
broader: نقشه‌نگاری
preferred label: map grid @en
type: Concept