نقشه‌سازی تصویرسنجشی
alternative label: نقشه‌سازی تصویرسنجی
scope note: نقشه‌سازی که در آن منبع اصلی داده‌ها عکس است.
broader: نقشه‌سازی
preferred label: photogrammetric mapping @en
type: Concept

نقشه‌سازی
preferred label: mapping @en
type: Concept
narrower: نقشه‌سازی تصویرسنجشی