نقشه‌سازی رویشگاه
scope note: ترسیم رویشگاه‌های طبیعی یک جنگل بر روی نقشه پس از شناسایی و برداشت
broader: نقشه‌سازی
preferred label: site mapping @en
type: Concept

نقشه‌سازی
preferred label: mapping @en
type: Concept
narrower: نقشه‌سازی رویشگاه