ترمز دیسکی
scope note: سامانۀ ترمزی که در آن نیروی وارد بر لنت ترمز به دیسک منتقل می‌شود.
broader: ترمز
preferred label: disc brake @en
type: Concept

ترمز
preferred label: brake @en
type: Concept
narrower: ترمز دیسکی