قرقره کششی
scope note: مجموعه‌ای از چند قرقره برای کشیدن بافۀ حامل و ایجاد کشش در آن
broader: قرقره
preferred label: stretching pulley @en
type: Concept

قرقره
preferred label: pulley @en
type: Concept
narrower: قرقره کششی