افشانش گرمایی
preferred label: thermal spraying @en
type: Concept
narrower: افشانش پلاسمایی

افشانش پلاسمایی
scope note: نوعی افشانش گرمایی که در آن مادۀ پوششی براثر گرمای حاصل از قوس انتقال‌ناپذیر مشعل پلاسمایی ذوب و بر سطح افشانده می‌شود.
broader: افشانش گرمایی
preferred label: plasma spraying @en
type: Concept