کنترل وضعیت
preferred label: attitude control @en
type: Concept
narrower: چرخش‌نمای وضعیت

چرخش‌نمای وضعیت
scope note: ابزاری چرخش‌نمابنیان که وضعیت جسم پرنده را نسبت به سامانۀ مختصات مرجع تا 360 درجه نشان می‌دهد.
broader: کنترل وضعیت
preferred label: attitude gyro @en
type: Concept