آرایه لرزه‌یاب به‌خط
scope note: نوعی آرایۀ لرزه‌یاب که در آن همۀ لرزه‌یاب‌ها در امتداد خط لرزه‌نگاری هستند.
broader: آرایه لرزه‌یاب
preferred label: inline geophone array @en
type: Concept

آرایه لرزه‌یاب
preferred label: geophone array @en
type: Concept
narrower: آرایه لرزه‌یاب به‌خط