آرایه
preferred label: array @en
type: Concept
narrower: آرایه قطبی-قطبی

آرایه قطبی-قطبی
scope note: آرایه‌ای که در آن دو الکترود جریان و پتانسیل پشت سر هم و در فاصله‌ای دور از هم بر روی خط برداشت (survey line) قرار می‌گیرند.
broader: آرایه
preferred label: pole-pole array @en
type: Concept