آرایه
preferred label: array @en
type: Concept
narrower: آرایه ونر

آرایه ونر
alternative label: آرایه الکترود ونر
scope note: آرایه‌ای با الکترودهای هم‌فاصله و متقارن که می‌تواند در امتداد خط اندازه‌گیری گسترش یابد.
broader: آرایه
preferred label: Wenner array @en
type: Concept