باستان‌شناسی
preferred label: archaeology @en
type: Concept
narrower: باستان‌شناسی استقراری

باستان‌شناسی استقراری
scope note: پژوهش دربارۀ پراکندگی مکانی فعالیت‌های تخصصی و بقایای مادی آنها در یک محوطه یا در کل یک منطقۀ باستانی و ارتباط آنها با یکدیگر
broader: باستان‌شناسی
preferred label: settlement archaeology @en
type: Concept