لوازم آنتن
preferred label: antenna accessories @en
type: Concept
narrower: آنتن‌پوش

سطح گزینشی بسامد
preferred label: frequency selective surface @en
type: Concept
related: آنتن‌پوش

آنتن‌پوش
scope note: روکش عایق آنتن برای مصون نگه ‌داشتن آن در برابر عوامل طبیعی
related: سطح گزینشی بسامد
broader: لوازم آنتن
preferred label: radome @en
type: Concept