پیرش شتاب‌یافته
scope note: پیری زودرس یک ماده سریع‌تر از حالت معمول، هنگامی که تأثیر یک یا چند عامل از عوامل پیری به‌صورت مصنوعی در شرایط آزمایشگاهی افزایش یافته باشد.
broader: پیرش
preferred label: accelerated ageing @en
type: Concept

پیرش
preferred label: ageing @en
type: Concept
narrower: پیرش شتاب‌یافته