پیرش گسسته
scope note: پیرش آلیاژ در دو یا چند عملیات حرارتی به‌طوری‌که در پایان هر عملیات ماده تا دمای محیط سرد می‌شود.
broader: پیرش
preferred label: interrupted ageing @en
type: Concept

پیرش
preferred label: ageing @en
type: Concept
narrower: پیرش گسسته