سرداپیرش
scope note: پیرش براثر سرد کردن سریع پس از عملیات حرارتی محلولی
broader: پیرش
preferred label: quench ageing @en
type: Concept

پیرش
preferred label: ageing @en
type: Concept
narrower: سرداپیرش