تأیید اعتبار
preferred label: accreditation @en
type: Concept
narrower: مرجع تأیید اعتبار

مرجع تأیید اعتبار
scope note: نهاد ثالث مستقلی که ساختار سازمانی و مسئولیت‌ها و کارکردها و روال‌ها و فرایندها و منابع سازمان صدور گواهی را بررسی می‌کند.
broader: تأیید اعتبار
preferred label: accreditation authority @en
type: Concept