بسته تأیید اعتبار
scope note: مجموعۀ طرح امنیت سامانه و مستنداتی که مبنای تصمیم‌گیری دربارۀ اعتبارند.
broader: تأیید اعتبار
preferred label: accreditation package @en
type: Concept

تأیید اعتبار
preferred label: accreditation @en
type: Concept
narrower: بسته تأیید اعتبار