گرانش
preferred label: gravitation @en
type: Concept
related: انتقال به سرخ گرانشی

انتقال به سرخ گرانشی
alternative label: Finlay-Freundlich red-shift hypothesis @en
scope note: افزایش طولِ‌موج نوری که از اجسامِ با میدان گرانشیِ قوی گسیل می‌شود.
related: گرانش
broader: انتقال به سرخ
preferred label: gravitational red shift @en
type: Concept

انتقال به سرخ
preferred label: red shift @en
type: Concept
narrower: انتقال به سرخ گرانشی