شیدسپهر
preferred label: photosphere @en
type: Concept
related: کلف خورشیدی

فعالیت خورشیدی
preferred label: solar activity @en
type: Concept
narrower: کلف خورشیدی

کلف خورشیدی
alternative label: لکه خورشیدی
scope note: لکه‌های تاریکی بر سطح خورشید که دمای کمتری در مقایسه با اطراف خود دارند.
related: شیدسپهر
broader: فعالیت خورشیدی
preferred label: sunspot @en
type: Concept