رمزنگاری
preferred label: cryptography @en
type: Concept
narrower: رمزنگاری سبک

رمزنگاری سبک
scope note: شاخه‌ای از رمزنگاری که در آن طرح‌ها و قراردادهای رمزنگاری برای به‌کارگیری در محیط‌های دارای منابع محاسباتی و ذخیره‌سازی محدود بررسی می‌شوند.
broader: رمزنگاری
preferred label: lightweight cryptography @en
type: Concept