یک‌سوسازی
preferred label: rectification @en
type: Concept
narrower: یک‌سوسازی اپتیکی

یک‌سوسازی اپتیکی
alternative label: یک‌سوسازی نوری
scope note: اثر ناشی از برهم‌کنش یک یا چند میدان الکترومغناطیسی در محیط غیرخطی که به برقراری میدان غیرنوسانی انجامد.
broader: یک‌سوسازی
preferred label: optical rectification @en
type: Concept