پوش‌رنگ
preferred label: paint @en
type: Concept
narrower: پوش‌رنگ هواسلی

پوش‌رنگ هواسلی
scope note: ماده‌ای پوششی که آن را تحت فشار در قوطی‌های نفوذناپذیر وارد می‌کنند.
broader: پوش‌رنگ
preferred label: aerosol paint @en
type: Concept