پوش‌رنگ بی‌جلا
scope note: پوش‌رنگی که پرتوهای نور را چنان جذب می‌کند که هیچ نوع برقی بر سطح کار مشاهده نمی‌شود.
broader: پوش‌رنگ
preferred label: lusterless paint @en
type: Concept

پوش‌رنگ
preferred label: paint @en
type: Concept
narrower: پوش‌رنگ بی‌جلا