جوشکاری نفوذی
alternative label: جوشکاری پخشی
scope note: هرگونه جوشکاری که عمدتاً براثر نفوذ حالت جامد در دو طرف سطح اتصال انجام میشود.
broader: جوشکاری
preferred label: diffusion welding @en
type: Concept

جوشکاری
preferred label: welding @en
type: Concept
narrower: جوشکاری نفوذی