جوشکاری انفجاری
scope note: نوعی جوشکاری فشاری که در آن انفجار موجب برخورد قطعات و ایجاد اتصال میشود.
broader: جوشکاری
preferred label: explosive welding @en
type: Concept

جوشکاری
preferred label: welding @en
type: Concept
narrower: جوشکاری انفجاری