جوشکاری
preferred label: welding @en
type: Concept
narrower: جوشکاری ضربه‌ای

جوشکاری ضربه‌ای
scope note: فرایندی که در آن گرمای لحظه‌ای ازطریق قوس متمرکز بین سطوح جوش‌‌دادنی ایجاد میشود و سطوح بی‌درنگ با ضربه به ‌هم کوبیده می‌شوند.
broader: جوشکاری
preferred label: percussion welding @en
type: Concept