جوشکاری قوسی گاز‌محافظ ضربانی
scope note: نوعی جوشکاری قوسی گازمحافظ که در آن جریان برق ضربانی است.
broader: جوشکاری قوسی گازمحافظ
preferred label: pulsed gas metal arc welding @en
type: Concept

جوشکاری قوسی گازمحافظ
preferred label: gas metal arc welding @en
type: Concept
narrower: جوشکاری قوسی گاز‌محافظ ضربانی