جوشکاری میل‌پایه
scope note: نوعی جوشکاری برای اتصال یک میله یا شیئی شبیه به آن به قطعۀ کار
broader: جوشکاری
preferred label: stud welding @en
type: Concept

جوشکاری
preferred label: welding @en
type: Concept
narrower: جوشکاری میل‌پایه