جوشکاری گرمازایی
alternative label: جوشکاری ترمیتی
scope note: فرایندی که در آن فلز یا آلیاژ مذاب آزادشده از واکنش گرمازای آلومینیم با یک اکسید فلزی، فضای میان دو جزء جوش را پر و آنها را به یکدیگر متصل می‌کند.
broader: جوشکاری
preferred label: thermite welding @en
type: Concept

جوشکاری
preferred label: welding @en
type: Concept
narrower: جوشکاری گرمازایی