precipitation (physical chemistry)
alternative label: precipitation, electrostatic
scope note: for precipitation within solid system (microstructural changes) see precipitation
related: crystal growth from solution
related: crystallization
preferred label: بارش (شیمی فیزیک) @fa
type: Concept

crystal growth from solution
preferred label: رشد بلور از راه محلول @fa
type: Concept
related: precipitation (physical chemistry)

crystallization
preferred label: بلورش @fa
type: Concept
related: precipitation (physical chemistry)