بازشناسی الگو
preferred label: pattern recognition @en
type: Concept
narrower: بازشناسی نشانه

بازشناسی نشانه
alternative label: شناسایی نشانه
scope note: فرایندی که در آن نشانه‌های تصویری براساس یک قاعدۀ تصمیم‌گیری مشخص شناسایی می‌شود.
broader: بازشناسی الگو
preferred label: target recognition @en
type: Concept