organic compounds
preferred label: ترکیبات آلی @fa
type: Concept
narrower: organometallic compounds

metalorganic chemical vapour deposition
preferred label: نهشت بخار شیمیایی فلز-آلی @fa
type: Concept
related: organometallic compounds

organometallic compounds
alternative label: metalorganic compounds
scope note: refers to compounds in which the metal is directly attached to carbon. In the case of metal carbonyls and inorganic complexes these are indexed under the appropriate metal compound headings. In the case of metal complexes with organic ligands these are i
related: metalorganic chemical vapour deposition
broader: organic compounds
preferred label: ترکیبات آلی‌فلزی @fa
type: Concept