ترابرد یاخته‌ای
preferred label: cellular transport @en
type: Concept
narrower: ترابرد پیرایاخته‌ای

ترابرد پیرایاخته‌ای
scope note: جابه‌جایی مواد ازطریق لایه‌های یاخته‌ای با عبور از فضاهای بینِ‌یاخته‌ای
broader: ترابرد یاخته‌ای
preferred label: paracellular transport @en
type: Concept