ترابرد ترایاخته‌ای
scope note: جابه‌جایی مواد از لایه‌های یاخته‌ای با عبور از میان یاخته‌ها
broader: ترابرد یاخته‌ای
preferred label: transcellular transport @en
type: Concept

ترابرد یاخته‌ای
preferred label: cellular transport @en
type: Concept
narrower: ترابرد ترایاخته‌ای