dislocation scattering
alternative label: carrier scattering by dislocation
alternative label: پراکندگی حامل با درفتگی @fa
scope note: used for carrier scattering by dislocation
broader: transport process
preferred label: پراکندگی دررفتگی @fa
type: Concept

transport process
preferred label: فرایند ترابرد @fa
type: Concept
narrower: dislocation scattering