خط انتقال همخوان
scope note: خط انتقالی که در آن اتصال بین اجزای سامانه به‌گونه‌ای همخوان شده است که مانع از بازتاب نشانک‌ها می‌شود.
broader: خط انتقال
preferred label: matched transmission line @en
type: Concept

خط انتقال
preferred label: transmission line @en
type: Concept
narrower: خط انتقال همخوان