لاک
preferred label: lacquer @en
type: Concept
narrower: لاک مفرغ‌نما

لاک مفرغ‌نما
alternative label: لاک برنزنما
scope note: لاک شفافی که برای حفظ درخشندگی و تقویت رنگ بر سطوح فلزی درخشان زده می‌شود.
broader: لاک
preferred label: bronzing lacquer @en
type: Concept