برش‌نگاری پراشی
scope note: نوعی برش‌نگاری بر پایۀ اصل فِرما، یعنی مسیر انتشار با کمترین زمان
broader: برش‌نگاری
preferred label: diffraction tomography @en
type: Concept

برش‌نگاری
preferred label: tomography @en
type: Concept
narrower: برش‌نگاری پراشی