نهان‌نگاری
preferred label: steganography @en
type: Concept
narrower: نهان‌نگاری تصویر‌متحرک

نهان‌نگاری تصویر‌متحرک
scope note: ارسال پیام محرمانه با استفاده از داده‌های ویدیویی به‌عنوان رسانۀ پوششی
broader: نهان‌نگاری
preferred label: video steganography @en
type: Concept